BDBM466793 US10800764, Compound (I-M7)
SMILES CC1(C)CCC(=CC1)c1nc(ccc1NC(=O)c1nc(c[nH]1)C#N)[C@@H]1CC(C)(C)OC(C)(CO)C1
InChI Key
Data  1 IC50
  Tab Delimited (TSV)   2D SDfile   Computed 3D by Vconf -m prep SDfile
Find this compound or compounds like it in BindingDB:
Activity Spreadsheet -- Enzyme Inhibition Constant Data from BindingDB
Found 1 hit for monomerid = 466793
TargetMacrophage colony-stimulating factor 1 receptor(Homo sapiens (Human))
Janssen Pharmaceutica
US Patent
LigandPNGBDBM466793(US10800764, Compound (I-M7))
Affinity DataIC50:  10nM. Assay description: c-fms(h) was incubated with 8 mM MOPS pH 7.0, 0.2 mM EDTA, 250 μM KKKSPGEYVNIEFG, 10 mM MgAcetate and [γ-33P-ATP] (specific activity approx...
Ligand InfoPC cidPC sid
In DepthDetails US Patent