BDBM466856 US10800765, Example 82
SMILES Cc1c(Cc2ccc3c(c2)C(F)(F)CCS3(=O)=O)c2cc(F)ccc2n1Cc1nn[nH]n1
InChI Key InChIKey=REYNTMHOMZTDAF-UHFFFAOYSA-N
Data  1 IC50
  Tab Delimited (TSV)   2D SDfile   Computed 3D by Vconf -m prep SDfile
Find this compound or compounds like it in BindingDB:
Activity Spreadsheet -- Enzyme Inhibition Constant Data from BindingDB
Found 1 hit for monomerid = 466856
TargetProstaglandin D2 receptor 2(Homo sapiens (Human))
Chia Tai Tianqing Pharmaceutical Group
US Patent
LigandPNGBDBM466856(US10800765, Example 82)
Affinity DataIC50: >1.00E+3nM. Assay description: Experimental Method:PathHunter CHO-K1 CRTH2 β-arrestin cells (DiscoverX, catalogue number 93-0291C2) grew under standard conditions, and were in...
Ligand InfoPC cidPC sid
In DepthDetails US Patent