BDBM466959 8-chloro-3-((2,2-difluorocyclopropyl) methyl)-7-(2,3-benzodihydrofuran- 5-yl)-[1,2,4]triazole[4,3-a]pyridine::US10800776, Example 47
SMILES FC1(F)CC1Cc1nnc2c(Cl)c(ccn12)-c1ccc2OCCc2c1
InChI Key InChIKey=BGRAJOCWULLBPZ-UHFFFAOYSA-N
Data  1 IC50  1 EC50
  Tab Delimited (TSV)   2D SDfile   Computed 3D by Vconf -m prep SDfile
Find this compound or compounds like it in BindingDB:
Activity Spreadsheet -- Enzyme Inhibition Constant Data from BindingDB
Found 2 hits for monomerid = 466959
TargetPotassium voltage-gated channel subfamily H member 2(Homo sapiens (Human))
Shanghai Institute Of Material Medica, Chinese Academy Of Sciences
US Patent
LigandPNGBDBM466959(8-chloro-3-((2,2-difluorocyclopropyl) methyl)-7-(2...)
Affinity DataIC50:  4.88E+3nM. Assay description: Experimental method: hERG patch clamp detection methodExperimental procedure: Compound preparation: the stock solution of a compound was diluted with...
Ligand InfoPC cidPC sid
In DepthDetails US Patent
TargetMetabotropic glutamate receptor 2(Homo sapiens (Human))
Shanghai Institute Of Material Medica, Chinese Academy Of Sciences
US Patent
LigandPNGBDBM466959(8-chloro-3-((2,2-difluorocyclopropyl) methyl)-7-(2...)
Affinity DataEC50:  215nM. Assay description: Experimental materials: HEK/mGluR2 cell line (human GluR2 transfected HEK cell line), DMEM (FBS) medium, positive control LY487379 (purchased from si...
Ligand InfoPC cidPC sid
In DepthDetails US Patent