BDBM467282 (R)-7-amino-3-(1-(but-2-ynoyl)pyrrolidin-3-yl)- 1-(4-(2-fluorophenoxy)phenyl)-1,5-dihydro-4H- pyrazolo[3,4-d]pyridazin-4-one::US10800785, Example 73
SMILES CC#CC(=O)N1CC[C@H](C1)c1nn(-c2ccc(Oc3ccccc3F)cc2)c2c(N)n[nH]c(=O)c12
InChI Key InChIKey=BQZIXHTVRCJWSF-OAHLLOKOSA-N
Data  1 IC50
  Tab Delimited (TSV)   2D SDfile   Computed 3D by Vconf -m prep SDfile
Find this compound or compounds like it in BindingDB:
Activity Spreadsheet -- Enzyme Inhibition Constant Data from BindingDB
Found 1 hit for monomerid = 467282
TargetTyrosine-protein kinase BTK(Homo sapiens (Human))
Shanghai Fochon Pharmaceutical
US Patent
LigandPNGBDBM467282((R)-7-amino-3-(1-(but-2-ynoyl)pyrrolidin-3-yl)- 1-...)
Affinity DataIC50:  440nM. Assay description: MTS testing kit was purchased from Promega. The DMEM, Fetal bovine serum and Penicillin-Streptomycin were purchased from Gibco. Dimethyl sulfoxide (D...
Ligand InfoPC cidPC sid
In DepthDetails US Patent