BDBM467338 US10800786, Example 2.10
SMILES Cc1nnn(Cc2cc(ccc2CCC(=O)N2CC3=C(C2)CN(C3)C(=O)N2CCc3c(O)noc3C2)C(F)(F)F)n1
InChI Key InChIKey=BEQNLEQTUIYSHV-UHFFFAOYSA-N
Data  1 IC50
  Tab Delimited (TSV)   2D SDfile   Computed 3D by Vconf -m prep SDfile
Find this compound or compounds like it in BindingDB:
Activity Spreadsheet -- Enzyme Inhibition Constant Data from BindingDB
Found 1 hit for monomerid = 467338
TargetAtaxin-1(Homo sapiens (Human))
Hoffmann-La Roche
US Patent
LigandPNGBDBM467338(US10800786, Example 2.10)
Affinity DataIC50:  9nM. Assay description: ATX inhibition was measured by a fluorescence quenching assay using a specifically labeled substrate analogue (MR121 substrate). To obtain this MR121...
Ligand InfoPC cidPC sid
In DepthDetails US Patent