BDBM467349 US10800786, Example 3.00
SMILES O=C(OCc1c[nH]nn1)N1CC2=C(C1)CN(C2)C(=O)c1cc(OCC2CCOCC2)nc(c1)C1CC1
InChI Key InChIKey=QAHKKHHULIVAOJ-UHFFFAOYSA-N
Data  1 IC50
  Tab Delimited (TSV)   2D SDfile   Computed 3D by Vconf -m prep SDfile
Find this compound or compounds like it in BindingDB:
Activity Spreadsheet -- Enzyme Inhibition Constant Data from BindingDB
Found 1 hit for monomerid = 467349
TargetAtaxin-1(Homo sapiens (Human))
Hoffmann-La Roche
US Patent
LigandPNGBDBM467349(US10800786, Example 3.00)
Affinity DataIC50:  36nM. Assay description: ATX inhibition was measured by a fluorescence quenching assay using a specifically labeled substrate analogue (MR121 substrate). To obtain this MR121...
Ligand InfoPC cidPC sid
In DepthDetails US Patent