BDBM467849 (R)-N-(1-Acryloylpiperidin-3-yl)-5-(2'-chloro-[1,1'-biphenyl]-3-yl)- 4-oxo-4,5-dihydro-3H-1-thia-3,5,8-triazaacenaphthylene-2- carboxamide;::US10800792, Example 510::US10822348, Example 510
SMILES Clc1ccccc1-c1cccc(c1)-n1c2ccnc3sc(C(=O)N[C@@H]4CCCN(C4)C(=O)C=C)c([nH]c1=O)c23
InChI Key
Data  2 IC50
  Tab Delimited (TSV)   2D SDfile   Computed 3D by Vconf -m prep SDfile
Find this compound or compounds like it in BindingDB:
Activity Spreadsheet -- Enzyme Inhibition Constant Data from BindingDB
Found 2 hits for monomerid = 467849
TargetTyrosine-protein kinase BTK(Homo sapiens (Human))
Janssen Pharmaceutica
US Patent
LigandPNGBDBM467849((R)-N-(1-Acryloylpiperidin-3-yl)-5-(2'-chloro-[1,1...)
Affinity DataIC50:  10nM. Assay description: TBD
Ligand InfoPC cidPC sid
In DepthDetails US Patent
TargetTyrosine-protein kinase BTK [386-659](Homo sapiens (Human))
Janssen Pharmaceutica
US Patent
LigandPNGBDBM467849((R)-N-(1-Acryloylpiperidin-3-yl)-5-(2'-chloro-[1,1...)
Affinity DataIC50:  10nM. Assay description: A BTK kinase lanthascreen binding assay monitors compound binding to unphosphorylated-BTK kinase domain (UP-BTK), by competing with a fluorescent lab...
Ligand InfoPC cidPC sid
In DepthDetails US Patent