BDBM468288 3′-Deoxy-3-O-[(5,6-difluoro-2-oxo-3-chromenyl)methyl]-3′-[4-(3,4,5-trifluorophenyl)-1H-1,2,3-triazol-1-yl]-1,1′-sulfanediyl-di-β-D-galactopyranoside::US10800804, Example S8b
SMILES OC[C@H]1OC(S[C@@H]2OC(CO)[C@H](O)[C@@H](C2O)n2cc(nn2)-c2cc(F)c(F)c(F)c2)[C@H](O)C(OCc2cc3c(F)c(F)ccc3oc2=O)C1O
InChI Key InChIKey=VZWCREWZIXJWMB-YBANXDFPSA-N
Data  2 Kd
  Tab Delimited (TSV)   2D SDfile   Computed 3D by Vconf -m prep SDfile
Find this compound or compounds like it in BindingDB:
Activity Spreadsheet -- Enzyme Inhibition Constant Data from BindingDB
Found 2 hits for monomerid = 468288
TargetGalectin-3(Homo sapiens (Human))
TBA
US Patent
LigandPNGBDBM468288(3′-Deoxy-3-O-[(5,6-difluoro-2-oxo-3-chromeny...)
Affinity DataKd:  2nM. Assay description: The affinity of compounds S8a-c, S11, S16, S20a-b and S21 for galectins were determined by a fluorescence anisotropy assay where the compound was use...
Ligand InfoPC cidPC sid
In DepthDetails US Patent
TargetGalectin-1(Homo sapiens (Human))
TBA
US Patent
LigandPNGBDBM468288(3′-Deoxy-3-O-[(5,6-difluoro-2-oxo-3-chromeny...)
Affinity DataKd:  480nM. Assay description: The affinity of compounds S8a-c, S11, S16, S20a-b and S21 for galectins were determined by a fluorescence anisotropy assay where the compound was use...
Ligand InfoPC cidPC sid
In DepthDetails US Patent