BDBM468302 US10806720, Compound ARN-509
SMILES CC(=O)Nc1ccc(cc1F)N1C(=S)N(C(=O)C11CCC1)c1ccc(C#N)c(c1)C(F)(F)F
InChI Key InChIKey=DHEUXPKWDQIGRP-UHFFFAOYSA-N
Data  1 KI
  Tab Delimited (TSV)   2D SDfile   Computed 3D by Vconf -m prep SDfile
Find this compound or compounds like it in BindingDB:
Activity Spreadsheet -- Enzyme Inhibition Constant Data from BindingDB
Found 1 hit for monomerid = 468302
TargetAndrogen receptor(Homo sapiens (Human))
University Of Tennessee Research Foundation
US Patent
LigandPNGBDBM468302(US10806720, Compound ARN-509)
Affinity DataKi:  1.45E+3nM. Assay description: Methods: hAR-LBD (633-919) was cloned into pGex4t.1. Large scale GST-tagged AR-LBD was prepared and purified using a GST column. Recombinant AR-LBD w...
Ligand InfoPC cidPC sid
In DepthDetails US Patent