BDBM468319 2-{3-[2-amino-6-(1- ethyl-1,2,3,6- tetrahydropyridin-4-yl)- 7H-pyrrolo[2,3- d]pyrimidin-4-yl]- 2-(hydroxy- methyl)phenyl}-6- cyclopropyl- 8-fluoroisoquinolin- 1(2H)-one::US10793575, Example 91
SMILES CCN1CCC(=CC1)c1cc2c(nc(N)nc2[nH]1)-c1cccc(c1CO)-n1ccc2cc(cc(F)c2c1=O)C1CC1
InChI Key InChIKey=IMKFTHBYBIXBCC-UHFFFAOYSA-N
Data  2 IC50
  Tab Delimited (TSV)   2D SDfile   Computed 3D by Vconf -m prep SDfile
Find this compound or compounds like it in BindingDB:
Activity Spreadsheet -- Enzyme Inhibition Constant Data from BindingDB
Found 2 hits for monomerid = 468319
TargetTyrosine-protein kinase BTK [C481S](Homo sapiens (Human))
Carna Biosciences
US Patent
LigandPNGBDBM468319(2-{3-[2-amino-6-(1- ethyl-1,2,3,6- tetrahydropyrid...)
Affinity DataIC50:  1.10nM. Assay description: The kinase activity was measured using QuickScout Screening Assist (trademark) MSA (commercially available kit manufactured by Carna Biosciences, Inc...
Ligand InfoPC cidPC sid
In DepthDetails US Patent
TargetTyrosine-protein kinase BTK(Homo sapiens (Human))
Carna Biosciences
US Patent
LigandPNGBDBM468319(2-{3-[2-amino-6-(1- ethyl-1,2,3,6- tetrahydropyrid...)
Affinity DataIC50:  0.470nM. Assay description: The kinase activity was measured using QuickScout Screening Assist (trade mark) MSA (commercially available kit manufactured by Carna Biosciences, In...
Ligand InfoPC cidPC sid
In DepthDetails US Patent