BDBM468337 US10806720, Compound 1018::US11648234, Compound 1018
SMILES C[C@](O)(Cn1cncn1)C(=O)Nc1ccc(C#N)c(c1)C(F)(F)F
InChI Key InChIKey=BMJMZDTWBQJLLX-ZDUSSCGKSA-N
Data  1 KI  3 IC50
  Tab Delimited (TSV)   2D SDfile   Computed 3D by Vconf -m prep SDfile
Find this compound or compounds like it in BindingDB:
Activity Spreadsheet -- Enzyme Inhibition Constant Data from BindingDB
Found 4 hits for monomerid = 468337
TargetAndrogen receptor(Rattus norvegicus (Rat))
University Of Tennessee Health Science Center
Curated by ChEMBL
LigandPNGBDBM468337(US10806720, Compound 1018 | US11648234, Compound 1...)
Affinity DataKi: >1.00E+4nM. Assay description: Inhibition of [3H] MIB binding to rat prostate androgen receptor LBD by competitive binding assay
Ligand InfoPC cidPC sid
In DepthDetails ArticlePubMed
TargetAndrogen receptor [633-919](Homo sapiens (Human))
University Of Tennessee Research Foundation
US Patent
LigandPNGBDBM468337(US10806720, Compound 1018 | US11648234, Compound 1...)
Affinity DataIC50:  1.09E+3nM. Assay description: Methods: hAR-LBD (633-919) was cloned into pGex4t.1. Large scale GST-tagged AR-LBD was prepared and purified using a GST column. Recombinant AR-LBD w...
Ligand InfoPC cidPC sid
In DepthDetails US Patent
TargetAndrogen receptor(Homo sapiens (Human))
University Of Tennessee Health Science Center
Curated by ChEMBL
LigandPNGBDBM468337(US10806720, Compound 1018 | US11648234, Compound 1...)
Affinity DataIC50:  1.09E+3nM. Assay description: Antagonist activity at human androgen receptor expressed in HEK-293 cells harboring GRE-LUC and CMV-renilla luciferase assessed as inhibition of tran...
Ligand InfoPC cidPC sid
In DepthDetails ArticlePubMed
TargetAndrogen receptor(Homo sapiens (Human))
University Of Tennessee Health Science Center
Curated by ChEMBL
LigandPNGBDBM468337(US10806720, Compound 1018 | US11648234, Compound 1...)
Affinity DataIC50:  1.09E+3nM. Assay description: Methods: hAR-LBD (633-919) was cloned into pGex4t.1. Large scale GST-tagged AR-LBD was prepared and purified using a GST column. Recombinant AR-LBD w...
Ligand InfoPC cidPC sid
In DepthDetails US Patent