BDBM468596 (2S,3R)-2-(2-(3- acetyl-1H-indol-1- yl)acetamido)-N- (6-bromopyridin-2- yl)-3- hydroxybutanamide::US10807952, Cmp No. 16
SMILES C[C@@H](O)[C@H](NC(=O)Cn1cc(C(C)=O)c2ccccc12)C(=O)Nc1cccc(Br)n1
InChI Key InChIKey=VEEJCARRAVVIGK-XCLFUZPHSA-N
Data  1 IC50
  Tab Delimited (TSV)   2D SDfile   Computed 3D by Vconf -m prep SDfile
Find this compound or compounds like it in BindingDB:
Activity Spreadsheet -- Enzyme Inhibition Constant Data from BindingDB
Found 1 hit for monomerid = 468596
TargetComplement factor D(Homo sapiens (Human))
Achillion Pharmaceuticals
US Patent
LigandPNGBDBM468596((2S,3R)-2-(2-(3- acetyl-1H-indol-1- yl)acetamido)-...)
Affinity DataIC50:  5.50E+3nM. Assay description: TBD
Ligand InfoPC cidPC sid
In DepthDetails US Patent