BDBM468666 1-(2-((2S,4R)-4- fluoro-2-(2-fluoro- 3-(1H-thieno[3,2- c]pyrazol-3- yl)phenylcarbamoyl) pyrrolidin-1-yl)-2- oxoethyl)-1H- indazole-3- carboxamide::US10807952, Cmp No. 71
SMILES NC(=O)c1nn(CC(=O)N2C[C@H](F)C[C@H]2C(=O)Nc2cccc(-c3n[nH]c4ccsc34)c2F)c2ccccc12
InChI Key
Data  1 IC50
  Tab Delimited (TSV)   2D SDfile   Computed 3D by Vconf -m prep SDfile
Find this compound or compounds like it in BindingDB:
Activity Spreadsheet -- Enzyme Inhibition Constant Data from BindingDB
Found 1 hit for monomerid = 468666
TargetComplement factor D(Homo sapiens (Human))
Achillion Pharmaceuticals
US Patent
LigandPNGBDBM468666(1-(2-((2S,4R)-4- fluoro-2-(2-fluoro- 3-(1H-thieno[...)
Affinity DataIC50: <1.00E+3nM. Assay description: TBD
Ligand InfoPC cidPC sid
In DepthDetails US Patent