BDBM468676 (2S,4R)-1-(2-(3- acetyl-1H-indazol- 1-yl)acetyl)-4- fluoro-N-(2-fluoro- 3-(quinoxalin-6- yl)phenyl)pyrrolidine- 2-carboxamide::US10807952, Cmp No. 83
SMILES CC(=O)c1nn(CC(=O)N2C[C@H](F)C[C@H]2C(=O)Nc2cccc(-c3ccc4nccnc4c3)c2F)c2ccccc12
InChI Key InChIKey=UWUBBXMSLUNCLO-BCHFMIIMSA-N
Data  1 IC50
  Tab Delimited (TSV)   2D SDfile   Computed 3D by Vconf -m prep SDfile
Find this compound or compounds like it in BindingDB:
Activity Spreadsheet -- Enzyme Inhibition Constant Data from BindingDB
Found 1 hit for monomerid = 468676
TargetComplement factor D(Homo sapiens (Human))
Achillion Pharmaceuticals
US Patent
LigandPNGBDBM468676((2S,4R)-1-(2-(3- acetyl-1H-indazol- 1-yl)acetyl)-4...)
Affinity DataIC50: <1.00E+3nM. Assay description: TBD
Ligand InfoPC cidPC sid
In DepthDetails US Patent