BDBM468678 (2S,4R)-1-(2-(3- acetyl-1H-indazol- 1-yl)acetyl)-4- fluoro-N-(2-fluoro- 3-(1H-indol-5- yl)phenyl)pyrrolidine- 2-carboxamide::US10807952, Cmp No. 85
SMILES CC(=O)c1nn(CC(=O)N2C[C@H](F)C[C@H]2C(=O)Nc2cccc(c2F)-c2ccc3[nH]ccc3c2)c2ccccc12
InChI Key
Data  1 IC50
  Tab Delimited (TSV)   2D SDfile   Computed 3D by Vconf -m prep SDfile
Find this compound or compounds like it in BindingDB:
Activity Spreadsheet -- Enzyme Inhibition Constant Data from BindingDB
Found 1 hit for monomerid = 468678
TargetComplement factor D(Homo sapiens (Human))
Achillion Pharmaceuticals
US Patent
LigandPNGBDBM468678((2S,4R)-1-(2-(3- acetyl-1H-indazol- 1-yl)acetyl)-4...)
Affinity DataIC50: <1.00E+3nM. Assay description: TBD
Ligand InfoPC cidPC sid
In DepthDetails US Patent