BDBM468697 (2S,4R)-1-(2-(3- acetyl-1H-pyrrol-1- yl)acetyl)-N-(6- bromopyridin-2- yl)-4- fluoropyrrolidine-2- carboxamide::US10807952, Cmp No. 108
SMILES CC(=O)c1ccn(CC(=O)N2C[C@H](F)C[C@H]2C(=O)Nc2cccc(Br)n2)c1
InChI Key InChIKey=NONUCGOMYNUMSU-KGLIPLIRSA-N
Data  1 IC50
  Tab Delimited (TSV)   2D SDfile   Computed 3D by Vconf -m prep SDfile
Find this compound or compounds like it in BindingDB:
Activity Spreadsheet -- Enzyme Inhibition Constant Data from BindingDB
Found 1 hit for monomerid = 468697
TargetComplement factor D(Homo sapiens (Human))
Achillion Pharmaceuticals
US Patent
LigandPNGBDBM468697((2S,4R)-1-(2-(3- acetyl-1H-pyrrol-1- yl)acetyl)-N-...)
Affinity DataIC50:  5.50E+3nM. Assay description: TBD
Ligand InfoPC cidPC sid
In DepthDetails US Patent