BDBM468781 US10807959, Example 50
SMILES COc1ccnc(CNC(=O)c2cc(CNC3=NCCN3)cc(c2)-c2cc(C)c(F)cc2OC)c1
InChI Key InChIKey=WWCQDRCTKNPKTR-UHFFFAOYSA-N
Data  1 KI
  Tab Delimited (TSV)   2D SDfile   Computed 3D by Vconf -m prep SDfile
Find this compound or compounds like it in BindingDB:
Activity Spreadsheet -- Enzyme Inhibition Constant Data from BindingDB
Found 1 hit for monomerid = 468781
TargetWD repeat-containing protein 5(Homo sapiens (Human))
Vanderbilt University
US Patent
LigandPNGBDBM468781(US10807959, Example 50)
Affinity DataKi: <0.100nM. Assay description: A Time-Resolved Fluorescence Resonance Energy Transfer (TR-FRET) assay that measures the displacement of the 10mer-Thr-FAM probe in response to compo...
Ligand InfoPC cidPC sid
In DepthDetails US Patent