BDBM468924 US10807959, Example B63
SMILES COc1cc(CNC(=O)c2cc(CNC3=NCCN3)cc(c2)-c2ccc(F)nc2C)cc(OC)c1
InChI Key InChIKey=FBFIUNWMMTUQQO-UHFFFAOYSA-N
Data  1 KI
  Tab Delimited (TSV)   2D SDfile   Computed 3D by Vconf -m prep SDfile
Find this compound or compounds like it in BindingDB:
Activity Spreadsheet -- Enzyme Inhibition Constant Data from BindingDB
Found 1 hit for monomerid = 468924
TargetWD repeat-containing protein 5(Homo sapiens (Human))
Vanderbilt University
US Patent
LigandPNGBDBM468924(US10807959, Example B63)
Affinity DataKi:  0.131nM. Assay description: FPA Assay protocol adopted from Karatas et al. (J. Med. Chem. 2010, 5179.; J. Amer. Chem. Soc. 2013, 669.): WDR5 (Δ23, residues 24-334), is expr...
Ligand InfoPC cidPC sid
In DepthDetails US Patent