BDBM469111 US10807974, Example 130::US10995088, Example 130::US11608330, Example 130
SMILES CCn1cc(cn1)-c1cc(OC)cc(c1)S(=O)(=O)c1cnc(CN)s1
InChI Key InChIKey=FUQHJEKHURTPJR-UHFFFAOYSA-N
Data  3 IC50
  Tab Delimited (TSV)   2D SDfile   Computed 3D by Vconf -m prep SDfile
Find this compound or compounds like it in BindingDB:
Activity Spreadsheet -- Enzyme Inhibition Constant Data from BindingDB
Found 3 hits for monomerid = 469111
TargetLysyl oxidase homolog 2(Homo sapiens (Human))
The Institute Of Cancer Research: Royal Cancer Hospital
US Patent
LigandPNGBDBM469111(US10807974, Example 130 | US10995088, Example 130 ...)
Affinity DataIC50:  94nM. Assay description: LOXL2 batch is obtained from R&D systems/Bio-techne. Incubate for 1 hour at room temp on a plate shaker.
Ligand InfoPC cidPC sid
In DepthDetails US Patent
TargetLysyl oxidase homolog 2(Homo sapiens (Human))
The Institute Of Cancer Research: Royal Cancer Hospital
US Patent
LigandPNGBDBM469111(US10807974, Example 130 | US10995088, Example 130 ...)
Affinity DataIC50:  94nM
Ligand InfoPC cidPC sid
In DepthDetails US Patent
TargetLysyl oxidase homolog 2(Homo sapiens (Human))
The Institute Of Cancer Research: Royal Cancer Hospital
US Patent
LigandPNGBDBM469111(US10807974, Example 130 | US10995088, Example 130 ...)
Affinity DataIC50:  94nM. Assay description: 10. Incubate for 1 hr at room temp on a plate shaker, protected from light.
Ligand InfoPC cidPC sid
In DepthDetails US Patent