BDBM469118 US10807974, Example 137::US10995088, Example 137::US11608330, Example 137
SMILES Cn1cnc(c1)-c1cc(cc(c1)S(=O)(=O)c1ccc(CN)s1)S(C)(=O)=O
InChI Key InChIKey=HVLPJKDYIMXTAF-UHFFFAOYSA-N
Data  3 IC50
  Tab Delimited (TSV)   2D SDfile   Computed 3D by Vconf -m prep SDfile
Find this compound or compounds like it in BindingDB:
Activity Spreadsheet -- Enzyme Inhibition Constant Data from BindingDB
Found 3 hits for monomerid = 469118
TargetLysyl oxidase homolog 2(Homo sapiens (Human))
The Institute Of Cancer Research: Royal Cancer Hospital
US Patent
LigandPNGBDBM469118(US10807974, Example 137 | US10995088, Example 137 ...)
Affinity DataIC50:  79nM. Assay description: LOXL2 batch is obtained from R&D systems/Bio-techne. Incubate for 1 hour at room temp on a plate shaker.
Ligand InfoPC cidPC sid
In DepthDetails US Patent
TargetLysyl oxidase homolog 2(Homo sapiens (Human))
The Institute Of Cancer Research: Royal Cancer Hospital
US Patent
LigandPNGBDBM469118(US10807974, Example 137 | US10995088, Example 137 ...)
Affinity DataIC50:  79nM
Ligand InfoPC cidPC sid
In DepthDetails US Patent
TargetLysyl oxidase homolog 2(Homo sapiens (Human))
The Institute Of Cancer Research: Royal Cancer Hospital
US Patent
LigandPNGBDBM469118(US10807974, Example 137 | US10995088, Example 137 ...)
Affinity DataIC50:  79nM. Assay description: 10. Incubate for 1 hr at room temp on a plate shaker, protected from light.
Ligand InfoPC cidPC sid
In DepthDetails US Patent