BDBM469241 US10807985, Compound 16
SMILES N#Cc1ccc(cc1)-c1cc2c(ncnn2c1)N1CCN(CC1)c1ncc(Cc2ccccc2)cn1
InChI Key InChIKey=MAGSKDRCMACAOT-UHFFFAOYSA-N
Data  1 IC50
  Tab Delimited (TSV)   2D SDfile   Computed 3D by Vconf -m prep SDfile
Find this compound or compounds like it in BindingDB:
Activity Spreadsheet -- Enzyme Inhibition Constant Data from BindingDB
Found 1 hit for monomerid = 469241
TargetMast/stem cell growth factor receptor Kit [D816V](Homo sapiens (Human))
Blueprint Medicines
US Patent
LigandPNGBDBM469241(US10807985, Compound 16)
Affinity DataIC50:  5.5nM. Assay description: In each well of a 384-well plate, 0.04 ng/ul (0.5 nM) of D816V KIT (Carna Bioscience 08-156) was incubated in a total of 12.5 ul of buffer (100 mM HE...
Ligand InfoPC cidPC sid
In DepthDetails US Patent