BDBM469293 US10807985, Compound 68
SMILES CO[C@](C)(c1ccc(F)cc1)c1cnc(nc1)N1CCN(CC1)c1ncnn2cc(cc12)-c1cnn(C)c1
InChI Key InChIKey=FKNPENIHAAPMRC-HHHXNRCGSA-N
Data  2 IC50
  Tab Delimited (TSV)   2D SDfile   Computed 3D by Vconf -m prep SDfile
Find this compound or compounds like it in BindingDB:
Activity Spreadsheet -- Enzyme Inhibition Constant Data from BindingDB
Found 2 hits for monomerid = 469293
TargetPlatelet-derived growth factor receptor alpha [D842V](Homo sapiens (Human))
Blueprint Medicines
US Patent
LigandPNGBDBM469293(US10807985, Compound 68)
Affinity DataIC50:  5.5nM. Assay description: In each well of a 384-well plate, 0.7 ng/ul (8 nM) of PDGFRA D842V (ProQinase 0761-0000-1) was incubated in a total of 12.5 ul of buffer (100 mM HEPE...
Ligand InfoPC cidPC sid
In DepthDetails US Patent
TargetMast/stem cell growth factor receptor Kit [D816V](Homo sapiens (Human))
Blueprint Medicines
US Patent
LigandPNGBDBM469293(US10807985, Compound 68)
Affinity DataIC50:  5.5nM. Assay description: In each well of a 384-well plate, 0.04 ng/ul (0.5 nM) of D816V KIT (Carna Bioscience 08-156) was incubated in a total of 12.5 ul of buffer (100 mM HE...
Ligand InfoPC cidPC sid
In DepthDetails US Patent