BDBM469333 US10807985, Compound 108
SMILES Cn1cc(cn1)-c1cn2ncnc(N3CCN(CC3)c3ncc(cn3)[C@@](C)(O)c3ccc(F)cc3)c2c1Cl
InChI Key InChIKey=QNCLKIYNKSIRGD-SANMLTNESA-N
Data  1 IC50
  Tab Delimited (TSV)   2D SDfile   Computed 3D by Vconf -m prep SDfile
Find this compound or compounds like it in BindingDB:
Activity Spreadsheet -- Enzyme Inhibition Constant Data from BindingDB
Found 1 hit for monomerid = 469333
TargetMast/stem cell growth factor receptor Kit [D816V](Homo sapiens (Human))
Blueprint Medicines
US Patent
LigandPNGBDBM469333(US10807985, Compound 108)
Affinity DataIC50: >100nM. Assay description: In each well of a 384-well plate, 0.04 ng/ul (0.5 nM) of D816V KIT (Carna Bioscience 08-156) was incubated in a total of 12.5 ul of buffer (100 mM HE...
Ligand InfoPC cidPC sid
In DepthDetails US Patent