BDBM46943 1-(3-bromanyl-4-methoxy-phenyl)sulfonylazepane::1-(3-bromo-4-methoxy-phenyl)sulfonylazepane::1-(3-bromo-4-methoxyphenyl)sulfonylazepane::MLS000703673::SMR000274038::cid_800461
SMILES COc1ccc(cc1Br)S(=O)(=O)N1CCCCCC1
InChI Key InChIKey=PHHUUZFLIXNSFI-UHFFFAOYSA-N
Data  2 EC50
  Tab Delimited (TSV)   2D SDfile   Computed 3D by Vconf -m prep SDfile
Find this compound or compounds like it in BindingDB:
Activity Spreadsheet -- Enzyme Inhibition Constant Data from BindingDB
Found 2 hits for monomerid = 46943
TargetIon channel NompC(Danio rerio)
The Scripps Research Institute Molecular Screening Center
Curated by PubChem BioAssay
LigandPNGBDBM46943(1-(3-bromanyl-4-methoxy-phenyl)sulfonylazepane | 1...)
Affinity DataEC50:  2.99E+4nM. Assay description: Source (MLPCN Center Name): The Scripps Research Institute Molecular Screening Center (SRIMSC) Center Affiliation: The Scripps Research Institute (TS...
In DepthDetails PCBioAssay
TargetMucolipin-3(Homo sapiens (Human))
The Scripps Research Institute Molecular Screening Center
Curated by PubChem BioAssay
LigandPNGBDBM46943(1-(3-bromanyl-4-methoxy-phenyl)sulfonylazepane | 1...)
Affinity DataEC50:  2.67E+3nM. Assay description: Source (MLPCN Center Name): The Scripps Research Institute Molecular Screening Center (SRIMSC) Center Affiliation: The Scripps Research Institute (TS...
In DepthDetails PCBioAssay