BDBM469835 CIS-1-(Cyclobutyl-methyl)-8-dimethylamino-3-[2-(3-hydroxy-piperidin-1-yl)-2- oxo-ethyl]-8-phenyl-1,3-diazaspiro[4.5]decan-2-one::US10807989, Example SC_1063
SMILES CN(C)[C@]1(CC[C@]2(CN(CC(=O)N3CCCC(O)C3)C(=O)N2CC2CCC2)CC1)c1ccccc1
InChI Key InChIKey=UFTITLNHRZVDEX-WFVNRGBPSA-N
Data  2 KI
  Tab Delimited (TSV)   2D SDfile   Computed 3D by Vconf -m prep SDfile
Find this compound or compounds like it in BindingDB:
Activity Spreadsheet -- Enzyme Inhibition Constant Data from BindingDB
Found 2 hits for monomerid = 469835
TargetNociceptin receptor(Homo sapiens (Human))
GrÜNenthal
US Patent
LigandPNGBDBM469835(CIS-1-(Cyclobutyl-methyl)-8-dimethylamino-3-[2-(3-...)
Affinity DataKi:  1.60nM. Assay description: The hNOP receptor binding assay was performed as homogeneous SPA-assay (scintillation proximity assay) using the assay buffer 50 mM TRIS-HCl, 10 mM M...
Ligand InfoPC cidPC sid
In DepthDetails US Patent
TargetMu-type opioid receptor(Homo sapiens (Human))
GrÜNenthal
US Patent
LigandPNGBDBM469835(CIS-1-(Cyclobutyl-methyl)-8-dimethylamino-3-[2-(3-...)
Affinity DataKi:  22nM. Assay description: The hMOP receptor binding assay was performed as homogeneous SPA-assay (scintillation proximity assay) using the assay buffer 50 mM TRIS-HCl (pH 7.4)...
Ligand InfoPC cidPC sid
In DepthDetails US Patent