BDBM46987 MLS000859158::N-[2-bromanyl-4-(4-chlorophenyl)sulfonyl-thiophen-3-yl]-2-chloranyl-benzamide::N-[2-bromo-4-(4-chlorophenyl)sulfonyl-3-thienyl]-2-chloro-benzamide::N-[2-bromo-4-(4-chlorophenyl)sulfonyl-3-thiophenyl]-2-chlorobenzamide::N-[2-bromo-4-(4-chlorophenyl)sulfonylthiophen-3-yl]-2-chlorobenzamide::N1-{2-bromo-4-[(4-chlorophenyl)sulfonyl]-3-thienyl}-2-chlorobenzamide::SMR000459337::cid_2819400
SMILES Clc1ccc(cc1)S(=O)(=O)c1csc(Br)c1NC(=O)c1ccccc1Cl
InChI Key InChIKey=RDYHLEBQXQUZSW-UHFFFAOYSA-N
Data  3 EC50
  Tab Delimited (TSV)   2D SDfile   Computed 3D by Vconf -m prep SDfile
Find this compound or compounds like it in BindingDB:
Activity Spreadsheet -- Enzyme Inhibition Constant Data from BindingDB
Found 3 hits for monomerid = 46987
TargetMucolipin-3(Homo sapiens (Human))
The Scripps Research Institute Molecular Screening Center
Curated by PubChem BioAssay
LigandPNGBDBM46987(MLS000859158 | N-[2-bromanyl-4-(4-chlorophenyl)sul...)
Affinity DataEC50: >3.32E+3nM. Assay description: Source (MLPCN Center Name): The Scripps Research Institute Molecular Screening Center (SRIMSC) Center Affiliation: The Scripps Research Institute (TS...
In DepthDetails PCBioAssay
TargetHeat shock factor protein 1(Mus musculus)
Broad Institute
Curated by PubChem BioAssay
LigandPNGBDBM46987(MLS000859158 | N-[2-bromanyl-4-(4-chlorophenyl)sul...)
Affinity DataEC50: >2.60E+5nM. Assay description: Keywords: Heat Shock Factor-1 (HSF-1), Stress Response, MG132, NIH3T3, Luminescence Assay Overview: Confirmation testing of small molecules identifie...
In DepthDetails PCBioAssay
TargetIon channel NompC(Danio rerio)
The Scripps Research Institute Molecular Screening Center
Curated by PubChem BioAssay
LigandPNGBDBM46987(MLS000859158 | N-[2-bromanyl-4-(4-chlorophenyl)sul...)
Affinity DataEC50:  2.99E+4nM. Assay description: Source (MLPCN Center Name): The Scripps Research Institute Molecular Screening Center (SRIMSC) Center Affiliation: The Scripps Research Institute (TS...
In DepthDetails PCBioAssay