BDBM470094 US10807993, Example 33
SMILES Cn1cncc1CN1CCC2(CC1)COC1C(C2)C(C)(C)Oc2cc(Cl)ccc12
InChI Key InChIKey=IIZSOJOUYFXWOY-UHFFFAOYSA-N
Data  1 IC50
  Tab Delimited (TSV)   2D SDfile   Computed 3D by Vconf -m prep SDfile
Find this compound or compounds like it in BindingDB:
Activity Spreadsheet -- Enzyme Inhibition Constant Data from BindingDB
Found 1 hit for monomerid = 470094
TargetPotassium voltage-gated channel subfamily H member 2(Homo sapiens (Human))
Sumitomo Dainippon Pharma
US Patent
LigandPNGBDBM470094(US10807993, Example 33)
Affinity DataIC50:  1.40E+3nM. Assay description: To a cultured CHO cell strain which stably expresses hERG was added each test compound to adjust the final concentration of DMSO to 0.0135 to 0.5%. T...
Ligand InfoPC cidPC sid
In DepthDetails US Patent