BDBM470152 US10807994, Compound 1.28::US10807994, Example S-28
SMILES CC1(C)CNCc2cc(Nc3ncc4C(=O)N(COc4n3)c3c(F)cccc3Cl)ccc12
InChI Key InChIKey=HPWBXSMVCDIXMI-UHFFFAOYSA-N
Data  1 IC50
  Tab Delimited (TSV)   2D SDfile   Computed 3D by Vconf -m prep SDfile
Find this compound or compounds like it in BindingDB:
Activity Spreadsheet -- Enzyme Inhibition Constant Data from BindingDB
Found 1 hit for monomerid = 470152
TargetWee1-like protein kinase(Homo sapiens (Human))
Nuvation Bio
US Patent
LigandPNGBDBM470152(US10807994, Compound 1.28 | US10807994, Example S-...)
Affinity DataIC50:  35nM. Assay description: IC50 values of compounds against WEE1 kinase enzyme were determined by LanthaScreen™ Terbium Labeled TR-FRET assay. Kinase assays were performed in 1...
Ligand InfoPC cidPC sid
In DepthDetails US Patent