BDBM47028 3-(4-bromophenyl)sulfonyl-N-[(4-methylphenyl)methyl]propanamide::3-[(4-bromophenyl)sulfonyl]-N-(4-methylbenzyl)propanamide::3-brosyl-N-(4-methylbenzyl)propionamide::MLS000682777::SMR000312134::cid_4293406
SMILES Cc1ccc(CNC(=O)CCS(=O)(=O)c2ccc(Br)cc2)cc1
InChI Key InChIKey=YLRBQPFFCAMCQC-UHFFFAOYSA-N
Data  1 IC50
  Tab Delimited (TSV)   2D SDfile   Computed 3D by Vconf -m prep SDfile
Find this compound or compounds like it in BindingDB:
Activity Spreadsheet -- Enzyme Inhibition Constant Data from BindingDB
Found 1 hit for monomerid = 47028
TargetPhosphotransferase(Trypanosoma brucei)
University Of Pittsburgh
Curated by PubChem BioAssay
LigandPNGBDBM47028(3-(4-bromophenyl)sulfonyl-N-[(4-methylphenyl)methy...)
Affinity DataIC50:  3.27E+3nM. Assay description: Excerpt from MH082340 application (Dr. James Morris, Clemson University) Trypanosoma brucei, the digenic protozoan parasite that causes African sleep...
In DepthDetails PCBioAssay