BDBM470286 N-[3-(7-{1-[2-(3-Hydroxyazetidin-1-yl)-1-methyl-2-oxoethyl]-1H-pyrazol-4-yl}imidazo[1,2-b]pyridazin-3-yl)phenyl]-N′-(2,2,2-trifluoroethyl)urea::US10813930, Ex. No. 64
SMILES CC(C(=O)N1CC(O)C1)n1cc(cn1)-c1cnn2c(cnc2c1)-c1cccc(NC(=O)NCC(F)(F)F)c1
InChI Key InChIKey=XMVWWTUDUPZADA-UHFFFAOYSA-N
Data  1 IC50
  Tab Delimited (TSV)   2D SDfile   Computed 3D by Vconf -m prep SDfile
Find this compound or compounds like it in BindingDB:
Activity Spreadsheet -- Enzyme Inhibition Constant Data from BindingDB
Found 1 hit for monomerid = 470286
TargetFibroblast growth factor receptor 3(Homo sapiens (Human))
Incyte
US Patent
LigandPNGBDBM470286(N-[3-(7-{1-[2-(3-Hydroxyazetidin-1-yl)-1-methyl-2-...)
Affinity DataIC50: <10nM. Assay description: FGFR3 Enzymatic Assay The inhibitor potency of compounds of the invention was measured in an enzyme assay that measures peptide phosphorylation using...
Ligand InfoPC cidPC sid
In DepthDetails US Patent