BDBM470581 5-Fluoro-2-[(4-{7-[(1S,3S,4R)-5-methylidene-2-azabicyclo[2.2.2]octane-3-carbonyl]-2,7-diazaspiro[3.5]nonan-2-yl}pyrimidin-5-yl)oxy]-N,N-di(propan-2-yl)benzamide::US10815241, Example 6::US11369605, Example 6
SMILES CC(C)N(C(C)C)C(=O)c1cc(F)ccc1Oc1cncnc1N1CC2(C1)CCN(CC2)C(=O)[C@H]1N[C@H]2CC[C@@H]1C(=C)C2
InChI Key InChIKey=JQHJEDMMWUIYCE-FVVBACEJSA-N
Data  2 IC50
  Tab Delimited (TSV)   2D SDfile   Computed 3D by Vconf -m prep SDfile
Find this compound or compounds like it in BindingDB:
Activity Spreadsheet -- Enzyme Inhibition Constant Data from BindingDB
Found 2 hits for monomerid = 470581
TargetHistone-lysine N-methyltransferase 2A/Menin(Homo sapiens (Human))
Sumitomo Dainippon Pharma
US Patent
LigandPNGBDBM470581(5-Fluoro-2-[(4-{7-[(1S,3S,4R)-5-methylidene-2-azab...)
Affinity DataIC50: <3nM. Assay description: Menin1-615 wherein 6×His tag and HA tag are inserted in the N-terminus, and myc tag is inserted in the C-terminus (hereinafter, referred to as His-Me...
Ligand InfoPC cidPC sid
In DepthDetails US Patent
TargetMenin(Homo sapiens (Human))
Sumitomo Dainippon Pharma
US Patent
LigandPNGBDBM470581(5-Fluoro-2-[(4-{7-[(1S,3S,4R)-5-methylidene-2-azab...)
Affinity DataIC50: <3nM. Assay description: Menin1-615 wherein 6×His tag and HA tag are inserted in the N-terminus, and myc tag is inserted in the C-terminus (hereinafter, referred to as His-Me...
Ligand InfoPC cidPC sid
In DepthDetails US Patent