BDBM470683 (S)-2,6-difluoro-3-methyl-4-(methyl(1-((6-methylpyridin-2-yl)methyl)pyrrolidin-3-yl)amino)-N-(thiazol-4-yl)benzenesulfonamide formate::US10815229, Example 104
SMILES CN([C@H]1CCN(Cc2cccc(C)n2)C1)c1cc(F)c(c(F)c1C)S(=O)(=O)Nc1cscn1
InChI Key InChIKey=LMDKRPWLOLFNQF-KRWDZBQOSA-N
Data  5 IC50
  Tab Delimited (TSV)   2D SDfile   Computed 3D by Vconf -m prep SDfile
Find this compound or compounds like it in BindingDB:
Activity Spreadsheet -- Enzyme Inhibition Constant Data from BindingDB
Found 5 hits for monomerid = 470683
TargetSodium channel protein type 8 subunit alpha(Homo sapiens (Human))
Xenon Pharmaceuticals
US Patent
LigandPNGBDBM470683((S)-2,6-difluoro-3-methyl-4-(methyl(1-((6-methylpy...)
Affinity DataIC50:  26nM. Assay description: In general, Trex HEK293 cells were stably transfected with an inducible expression vector containing the full-length cDNA coding for the desired huma...
Ligand InfoPC cidPC sid
In DepthDetails US Patent
TargetSodium channel protein type 5 subunit alpha(Homo sapiens (Human))
Xenon Pharmaceuticals
US Patent
LigandPNGBDBM470683((S)-2,6-difluoro-3-methyl-4-(methyl(1-((6-methylpy...)
Affinity DataIC50: >3.00E+4nM. Assay description: In general, Trex HEK293 cells were stably transfected with an inducible expression vector containing the full-length cDNA coding for the desired huma...
Ligand InfoPC cidPC sid
In DepthDetails US Patent
TargetSodium channel protein type 1 subunit alpha(Homo sapiens (Human))
Xenon Pharmaceuticals
US Patent
LigandPNGBDBM470683((S)-2,6-difluoro-3-methyl-4-(methyl(1-((6-methylpy...)
Affinity DataIC50: >1.00E+4nM. Assay description: Patch voltage clamp electrophysiology allows for the direct measurement and quantification of block of voltage-gated sodium channels (Nay's), and...
Ligand InfoPC cidPC sid
In DepthDetails US Patent
TargetSodium channel protein type 8 subunit alpha(Homo sapiens (Human))
Xenon Pharmaceuticals
US Patent
LigandPNGBDBM470683((S)-2,6-difluoro-3-methyl-4-(methyl(1-((6-methylpy...)
Affinity DataIC50:  11nM. Assay description: Patch voltage clamp electrophysiology allows for the direct measurement and quantification of block of voltage-gated sodium channels (Nay's), and...
Ligand InfoPC cidPC sid
In DepthDetails US Patent
TargetSodium channel protein type 1 subunit alpha(Homo sapiens (Human))
Xenon Pharmaceuticals
US Patent
LigandPNGBDBM470683((S)-2,6-difluoro-3-methyl-4-(methyl(1-((6-methylpy...)
Affinity DataIC50: >3.00E+4nM. Assay description: In general, Trex HEK293 cells were stably transfected with an inducible expression vector containing the full-length cDNA coding for the desired huma...
Ligand InfoPC cidPC sid
In DepthDetails US Patent