BDBM471596 US10822334, Compound 8
SMILES COc1cc(OC2CCN(C)CC2(F)F)c2c(Nc3ccc(Oc4ccn5ccnc5c4)c(C)c3)ncnc2c1
InChI Key InChIKey=YZQDBWXUDUMPDB-UHFFFAOYSA-N
Data  2 IC50
  Tab Delimited (TSV)   2D SDfile   Computed 3D by Vconf -m prep SDfile
Find this compound or compounds like it in BindingDB:
Activity Spreadsheet -- Enzyme Inhibition Constant Data from BindingDB
Found 2 hits for monomerid = 471596
TargetEpidermal growth factor receptor(Homo sapiens (Human))
TBA
US Patent
LigandPNGBDBM471596(US10822334, Compound 8)
Affinity DataIC50:  1.80E+3nM. Assay description: EGFR: The compounds' inhibition of target modulation were determined as follows: NCI-H838 cells were sorted in 96 well plates (20000 cells/well) ...
Ligand InfoPC cidPC sid
In DepthDetails US Patent
TargetReceptor tyrosine-protein kinase erbB-2(Homo sapiens (Human))
TBA
US Patent
LigandPNGBDBM471596(US10822334, Compound 8)
Affinity DataIC50:  6.92nM. Assay description: HER2: The compounds' inhibition of target modulation were determined as follows: BT474 cells were sorted in 96 well plates (20000 cells/well) wit...
Ligand InfoPC cidPC sid
In DepthDetails US Patent