BDBM471697 US10822342, Compound 5
SMILES CCN1CCC(C1)n1cc(-c2nc(N)nc3cn(C)nc23)c2cc(C#CC(C)(C)O)c(F)cc12
InChI Key InChIKey=LVXQTRLNRCVXGT-UHFFFAOYSA-N
Data  1 IC50
  Tab Delimited (TSV)   2D SDfile   Computed 3D by Vconf -m prep SDfile
Find this compound or compounds like it in BindingDB:
Activity Spreadsheet -- Enzyme Inhibition Constant Data from BindingDB
Found 1 hit for monomerid = 471697
TargetMitogen-activated protein kinase kinase kinase 14(Homo sapiens (Human))
Janssen Pharmaceutica
US Patent
LigandPNGBDBM471697(US10822342, Compound 5)
Affinity DataIC50:  112nM. Assay description: NIK/MAP3K14 auto-phosphorylation activity was measured using the AlphaScreenŽ (αscreen) format (Perkin Elmer). All compounds tested were dissolv...
Ligand InfoPC cidPC sid
In DepthDetails US Patent