BDBM471715 (R)-N-(1-Acryloylpiperidin-3-yl)-5-(2-fluoro-4-phenoxyphenyl)-4-::US10822348, Example 10
SMILES Fc1cc(Oc2ccccc2)ccc1-n1c2ccnc3sc(C(=O)N[C@@H]4CCCN(C4)C(=O)C=C)c([nH]c1=O)c23
InChI Key
Data  1 KI  2 IC50
  Tab Delimited (TSV)   2D SDfile   Computed 3D by Vconf -m prep SDfile
Find this compound or compounds like it in BindingDB:
Activity Spreadsheet -- Enzyme Inhibition Constant Data from BindingDB
Found 3 hits for monomerid = 471715
TargetTyrosine-protein kinase BTK(Homo sapiens (Human))
Janssen Research & Development
Curated by ChEMBL
LigandPNGBDBM471715((R)-N-(1-Acryloylpiperidin-3-yl)-5-(2-fluoro-4-phe...)
Affinity DataKi:  9.20nM. Assay description: Covalent inhibition of recombinant human GST-tagged BTK (2 to 659 end residues) expressed in baculovirus expression system assessed as inhibition con...
Ligand InfoPC cidPC sid
In DepthDetails ArticlePubMed
TargetTyrosine-protein kinase BTK(Mus musculus)
Janssen Research & Development
Curated by ChEMBL
LigandPNGBDBM471715((R)-N-(1-Acryloylpiperidin-3-yl)-5-(2-fluoro-4-phe...)
Affinity DataIC50:  20nM. Assay description: Inhibition of BTK in C57Bl/6 mouse splenocyte assessed as reduction in anti-IgM-induced CD69 expression incubated for 1 hr followed anti-IgM stimulat...
Ligand InfoPC cidPC sid
In DepthDetails ArticlePubMed
TargetTyrosine-protein kinase BTK [386-659](Homo sapiens (Human))
Janssen Pharmaceutica
US Patent
LigandPNGBDBM471715((R)-N-(1-Acryloylpiperidin-3-yl)-5-(2-fluoro-4-phe...)
Affinity DataIC50:  7.94nM. Assay description: A BTK kinase lanthascreen binding assay monitors compound binding to unphosphorylated-BTK kinase domain (UP-BTK), by competing with a fluorescent lab...
Ligand InfoPC cidPC sid
In DepthDetails US Patent