BDBM471786 N-(4-(ethylsulfonyl)benzyl)-1-isobutyl-2- (((1s,4s)-4-(trifluoromethyl)cyclohexyl)oxy)- 1H-benzo[d]imidazole-5-carboxamide::US10829448, Compound BE-4.2
SMILES CCS(=O)(=O)c1ccc(CNC(=O)c2ccc3n(CC(C)C)c(O[C@H]4CC[C@@H](CC4)C(F)(F)F)nc3c2)cc1
InChI Key InChIKey=WXVSVVARKPKMDN-HZCBDIJESA-N
Data  1 KI
  Tab Delimited (TSV)   2D SDfile   Computed 3D by Vconf -m prep SDfile
Find this compound or compounds like it in BindingDB:
Activity Spreadsheet -- Enzyme Inhibition Constant Data from BindingDB
Found 1 hit for monomerid = 471786
TargetNuclear receptor ROR-gamma(Homo sapiens (Human))
Vitae Pharmaceuticals
US Patent
LigandPNGBDBM471786(N-(4-(ethylsulfonyl)benzyl)-1-isobutyl-2- (((1s,4s...)
Affinity DataKi: <100nM. Assay description: Compounds described herein were tested for ability to bind to RORγ in a cell-free competition assay with commercially available radio-ligand (RL...
Ligand InfoPC cidPC sid
In DepthDetails US Patent