BDBM471863 US10829448, Compound BE-57.3
SMILES CCS(=O)(=O)c1ccc(cc1)[C@H](CO)NC(=O)c1ccc2n(C)c(C[C@H]3CC[C@@H](OC3)C(F)(F)F)nc2c1
InChI Key InChIKey=FEPRISNDBLLTEY-XORNHQRDSA-N
Data  1 KI
  Tab Delimited (TSV)   2D SDfile   Computed 3D by Vconf -m prep SDfile
Find this compound or compounds like it in BindingDB:
Activity Spreadsheet -- Enzyme Inhibition Constant Data from BindingDB
Found 1 hit for monomerid = 471863
TargetNuclear receptor ROR-gamma(Homo sapiens (Human))
Vitae Pharmaceuticals
US Patent
LigandPNGBDBM471863(US10829448, Compound BE-57.3)
Affinity DataKi:  550nM. Assay description: Compounds described herein were tested for ability to bind to RORγ in a cell-free competition assay with commercially available radio-ligand (RL...
Ligand InfoPC cidPC sid
In DepthDetails US Patent