BDBM471878 (R)-2-(1-cyclopropyl-2-(((1r,4R)-4- (trifluoromethyl)cyclohexyl)methyl)-1H- benzo[d]imidazole-5-carboxamido)-2-(4- (ethylsulfonyl)phenyl)ethyl carbamate::US10829448, Compound BE-66
SMILES CCS(=O)(=O)c1ccc(cc1)[C@H](COC(N)=O)NC(=O)c1ccc2n(C3CC3)c(CC3CCC(CC3)C(F)(F)F)nc2c1
InChI Key InChIKey=QELDOEPETXSBRR-JUWHTYBZSA-N
Data  1 KI
  Tab Delimited (TSV)   2D SDfile   Computed 3D by Vconf -m prep SDfile
Find this compound or compounds like it in BindingDB:
Activity Spreadsheet -- Enzyme Inhibition Constant Data from BindingDB
Found 1 hit for monomerid = 471878
TargetNuclear receptor ROR-gamma(Homo sapiens (Human))
Vitae Pharmaceuticals
US Patent
LigandPNGBDBM471878((R)-2-(1-cyclopropyl-2-(((1r,4R)-4- (trifluorometh...)
Affinity DataKi: <100nM. Assay description: Compounds described herein were tested for ability to bind to RORγ in a cell-free competition assay with commercially available radio-ligand (RL...
Ligand InfoPC cidPC sid
In DepthDetails US Patent