BDBM471890 5-[3-[(3S)-4-(4- chloro-3-fluoro-5- methoxy-phenyl)- 3-methyl- piperazin- 1-yl]-2-methyl-3- oxo-propyl]-5- methyl- imidazolidine- 2,4-dione::US10829478, Compound 120
SMILES COc1cc(cc(F)c1Cl)N1CCN(C[C@@H]1C)C(=O)[C@@H](C)C[C@@]1(C)NC(=O)NC1=O
InChI Key InChIKey=ZEMLAXHMFOILNW-JOOBJXAISA-N
Data  6 IC50
  Tab Delimited (TSV)   2D SDfile   Computed 3D by Vconf -m prep SDfile
Find this compound or compounds like it in BindingDB:
Activity Spreadsheet -- Enzyme Inhibition Constant Data from BindingDB
Found 6 hits for monomerid = 471890
TargetA disintegrin and metalloproteinase with thrombospondin motifs 4(Homo sapiens (Human))
Galapagos
US Patent
LigandPNGBDBM471890(5-[3-[(3S)-4-(4- chloro-3-fluoro-5- methoxy-phenyl...)
Affinity DataIC50:  75nM. Assay description: TABLE VI: The basis for the assay is the cleavage of the substrate TBIS-1 (5 FAM-TEGEARGSVILLK (5TAMRA)K-NH2) (SEQ ID NO: 2) by human ADAMTS4.For the...
Ligand InfoPC cidPC sid
In DepthDetails US Patent
TargetA disintegrin and metalloproteinase with thrombospondin motifs 5(Homo sapiens (Human))
Galapagos
US Patent
LigandPNGBDBM471890(5-[3-[(3S)-4-(4- chloro-3-fluoro-5- methoxy-phenyl...)
Affinity DataIC50:  12.5nM. Assay description: TABLE IX: The basis for the assay is the cleavage of the substrate TBIS-1 (5 FAM-TEGEARGSVILLK (5TAMRA)K-NH2) (SEQ ID NO: 2) by human ADAMTS-5.For th...
Ligand InfoPC cidPC sid
In DepthDetails US Patent
TargetMatrix metalloproteinase-14(Homo sapiens (Human))
Galapagos
US Patent
LigandPNGBDBM471890(5-[3-[(3S)-4-(4- chloro-3-fluoro-5- methoxy-phenyl...)
Affinity DataIC50: >1.00E+4nM. Assay description: TABLE XIII: The basis for the assay is the cleavage of the substrate 390 MMP FRET Substrate I (Anaspec Cat #AS-27076) by human MMP13 (Enzo Life Scien...
Ligand InfoPC cidPC sid
In DepthDetails US Patent
TargetDisintegrin and metalloproteinase domain-containing protein 17(Homo sapiens (Human))
Galapagos
US Patent
LigandPNGBDBM471890(5-[3-[(3S)-4-(4- chloro-3-fluoro-5- methoxy-phenyl...)
Affinity DataIC50: >1.00E+4nM. Assay description: TABLE XI: The basis for the assay is the cleavage of the substrate 5FAM-LAQAVRSSSRK-5TAMRA (SEQ ID NO: 3) (Anaspec, custom 34891) by human TACE (R&D ...
Ligand InfoPC cidPC sid
In DepthDetails US Patent
TargetCollagenase 3(Homo sapiens (Human))
Galapagos
US Patent
LigandPNGBDBM471890(5-[3-[(3S)-4-(4- chloro-3-fluoro-5- methoxy-phenyl...)
Affinity DataIC50: >1.00E+4nM. Assay description: TABLE XII: The basis for the assay is the cleavage of the substrate 390 MMP FRET Substrate I (Anaspec Cat #AS-27076) by human MMP13 (Chemicon, Cat #C...
Ligand InfoPC cidPC sid
In DepthDetails US Patent
LigandPNGBDBM471890(5-[3-[(3S)-4-(4- chloro-3-fluoro-5- methoxy-phenyl...)
Affinity DataIC50:  12.5nM. Assay description: TABLE X: The IC50 value for test compounds can be determined in a fluorescent based protease assay.The basis for the assay is the cleavage of the sub...
Ligand InfoPC cidPC sid
In DepthDetails US Patent