BDBM472009 CIS-1-(Cyclobutyl-methyl)-8-dimethylamino-8-phenyl-3-(pyridin-3-yl-methyl)-1,3- diazaspiro[4.5]decan-2-one::US10829480, Example SC_2019
SMILES CN(C)[C@]1(CC[C@]2(CN(Cc3cccnc3)C(=O)N2CC2CCC2)CC1)c1ccccc1
InChI Key InChIKey=QFCYVANZZZLEKU-MKPDMIMOSA-N
Data  2 KI
  Tab Delimited (TSV)   2D SDfile   Computed 3D by Vconf -m prep SDfile
Find this compound or compounds like it in BindingDB:
Activity Spreadsheet -- Enzyme Inhibition Constant Data from BindingDB
Found 2 hits for monomerid = 472009
TargetMu-type opioid receptor(Homo sapiens (Human))
Gruenenthal
US Patent
LigandPNGBDBM472009(CIS-1-(Cyclobutyl-methyl)-8-dimethylamino-8-phenyl...)
Affinity DataKi:  0.800nM. Assay description: Mu-Opioid Peptide (hMOP): The hMOP receptor binding assay was performed as homogeneous SPA-assay (scintillation proximity assay) using the assay buff...
Ligand InfoPC cidPC sid
In DepthDetails US Patent
TargetNociceptin receptor(Homo sapiens (Human))
Gruenenthal
US Patent
LigandPNGBDBM472009(CIS-1-(Cyclobutyl-methyl)-8-dimethylamino-8-phenyl...)
Affinity DataKi:  50.8nM. Assay description: The hNOP receptor binding assay was performed as homogeneous SPA-assay (scintillation proximity assay) using the assay buffer 50 mM TRIS-HCl. 10 mM M...
Ligand InfoPC cidPC sid
In DepthDetails US Patent