BDBM472285 (R)-2-cyclopropyl-1-((2,2-dimethyl-2,3-dihydrobenzofuran-7-::US10829481, Compound I-101
SMILES CCS(=O)(=O)c1ccc(cc1)[C@H](CO)NC(=O)c1ccc2n(Cc3cccc4CC(C)(C)Oc34)c(nc2c1)C1CC1
InChI Key InChIKey=LCIMARSGJDEUOJ-MHZLTWQESA-N
Data  1 KI
  Tab Delimited (TSV)   2D SDfile   Computed 3D by Vconf -m prep SDfile
Find this compound or compounds like it in BindingDB:
Activity Spreadsheet -- Enzyme Inhibition Constant Data from BindingDB
Found 1 hit for monomerid = 472285
TargetNuclear receptor ROR-gamma(Homo sapiens (Human))
Vitae Pharmaceuticals
US Patent
LigandPNGBDBM472285((R)-2-cyclopropyl-1-((2,2-dimethyl-2,3-dihydrobenz...)
Affinity DataKi: <100nM. Assay description: Compounds described herein were tested for ability to bind to RORγ in a cell-free competition assay with commercially available radio-ligand (RL...
Ligand InfoPC cidPC sid
In DepthDetails US Patent