BDBM472440 US10829483, Compound WX040
SMILES OC(=O)CSc1nnc(Br)n1-c1sc(c2CCCc12)-c1ccc(Cl)cc1
InChI Key InChIKey=PRLKWFUGGMVXMG-UHFFFAOYSA-N
Data  1 IC50
  Tab Delimited (TSV)   2D SDfile   Computed 3D by Vconf -m prep SDfile
Find this compound or compounds like it in BindingDB:
Activity Spreadsheet -- Enzyme Inhibition Constant Data from BindingDB
Found 1 hit for monomerid = 472440
TargetSolute carrier family 22 member 12(Homo sapiens (Human))
Cstone Pharmaceutical (Suzhou)
US Patent
LigandPNGBDBM472440(US10829483, Compound WX040)
Affinity DataIC50: >5.00E+3nM. Assay description: Experimental Purpose:Determination of the IC50 value of the inhibitory activity of the compound against uric acid reabsorption by the HEK293 cell lin...
Ligand InfoPC cidPC sid
In DepthDetails US Patent