BDBM472526 US10829487, Example I-6
SMILES COCC1(CC1)n1cc2c(N[C@H](C)c3cccc(C(F)F)c3F)nc(C)nc2cc1=O
InChI Key InChIKey=CVRPUZUESSHZPE-GFCCVEGCSA-N
Data  1 IC50
  Tab Delimited (TSV)   2D SDfile   Computed 3D by Vconf -m prep SDfile
Find this compound or compounds like it in BindingDB:
Activity Spreadsheet -- Enzyme Inhibition Constant Data from BindingDB
Found 1 hit for monomerid = 472526
TargetGTPase KRas [1-169,G12D]/Son of sevenless homolog 1 [564-1049]()
Boehringer Ingelheim International
US Patent
LigandPNGBDBM472526(US10829487, Example I-6)
Affinity DataIC50:  6nM. Assay description: Compounds are diluted to a final start concentration of 100 μM and are tested in duplicate. Assay-ready plates (ARPs) are generated using an Acc...
Ligand InfoPC cidPC sid
In DepthDetails US Patent