BDBM472640 US10829487, Example I-123
SMILES C[C@@H](Nc1nc(C)nc2cc(=O)n(cc12)C1(C)CCOC1)c1cccc(C(F)F)c1C
InChI Key InChIKey=NXJNVANYUDNXMJ-PDNQZYNLSA-N
Data  1 IC50
  Tab Delimited (TSV)   2D SDfile   Computed 3D by Vconf -m prep SDfile
Find this compound or compounds like it in BindingDB:
Activity Spreadsheet -- Enzyme Inhibition Constant Data from BindingDB
Found 1 hit for monomerid = 472640
TargetGTPase KRas [1-169,G12D]/Son of sevenless homolog 1 [564-1049]()
Boehringer Ingelheim International
US Patent
LigandPNGBDBM472640(US10829487, Example I-123)
Affinity DataIC50:  3nM. Assay description: Compounds are diluted to a final start concentration of 100 μM and are tested in duplicate. Assay-ready plates (ARPs) are generated using an Acc...
Ligand InfoPC cidPC sid
In DepthDetails US Patent