BDBM472655 US10829487, Example I-162
SMILES C[C@@H](Nc1ncnc2c(C)c(=O)n(cc12)C1(CF)CC1)c1cccc(C(F)F)c1F
InChI Key InChIKey=CRSGWJXJQPUQLH-GFCCVEGCSA-N
Data  1 IC50
  Tab Delimited (TSV)   2D SDfile   Computed 3D by Vconf -m prep SDfile
Find this compound or compounds like it in BindingDB:
Activity Spreadsheet -- Enzyme Inhibition Constant Data from BindingDB
Found 1 hit for monomerid = 472655
TargetGTPase KRas [1-169,G12D]/Son of sevenless homolog 1 [564-1049]()
Boehringer Ingelheim International
US Patent
LigandPNGBDBM472655(US10829487, Example I-162)
Affinity DataIC50:  7nM. Assay description: Compounds are diluted to a final start concentration of 100 μM and are tested in duplicate. Assay-ready plates (ARPs) are generated using an Acc...
Ligand InfoPC cidPC sid
In DepthDetails US Patent