BDBM472702 US10836742, Compound 6
SMILES COc1cc(cc2CCC(=O)N(Cc3ccccc3)c12)-c1cc(C)c(=O)n(C)c1
InChI Key InChIKey=JFDTYTVVQMYOJN-UHFFFAOYSA-N
Data  1 IC50
  Tab Delimited (TSV)   2D SDfile   Computed 3D by Vconf -m prep SDfile
Find this compound or compounds like it in BindingDB:
Activity Spreadsheet -- Enzyme Inhibition Constant Data from BindingDB
Found 1 hit for monomerid = 472702
TargetBromodomain-containing protein 4 [49-170](Homo sapiens (Human))
Neomed Institute
US Patent
LigandPNGBDBM472702(US10836742, Compound 6)
Affinity DataIC50:  2.58E+3nM. Assay description: To measure activity of bromodomain inhibitors, a His-epitope tagged BRD4 BD149-170 is purchased from BPS Bioscience. BRD4 binding and inhibition is a...
Ligand InfoPC cidPC sid
In DepthDetails US Patent