BDBM472736 (R)-2-amino-5-(2-(2,5-difluorophenyl)pyrrolidin-1-yl)-N-(2-hydroxyethyl)pyrazolo[1,5-a]pyrimidine-3-carboxamide::US10829492, Example 13
SMILES Nc1nn2ccc(nc2c1C(=O)NCCO)N1CCC[C@@H]1c1cc(F)ccc1F
InChI Key InChIKey=APXOZFSEZAHZKT-CQSZACIVSA-N
Data  1 IC50
  Tab Delimited (TSV)   2D SDfile   Computed 3D by Vconf -m prep SDfile
Find this compound or compounds like it in BindingDB:
Activity Spreadsheet -- Enzyme Inhibition Constant Data from BindingDB
Found 1 hit for monomerid = 472736
TargetHigh affinity nerve growth factor receptor(Homo sapiens (Human))
Chia Tai Tianqing Pharmaceutical Group
US Patent
LigandPNGBDBM472736((R)-2-amino-5-(2-(2,5-difluorophenyl)pyrrolidin-1-...)
Affinity DataIC50: <1nM. Assay description: TrkA, TrkB and TrkC:A testing platform for TrkA, TrkB and TrkC kinase activity was established based on Homogeneous Time-Resolved Fluorescence (HTRF)...
Ligand InfoKEGGPC cidPC sid
In DepthDetails US Patent