BDBM472757 (R)-5-(2-(2,5-difluorophenyl)pyrrolidin-1-yl)-3-(1-methyl-1H-pyrazol-4-yl)pyrazolo[1,5-c]pyrimidin-2-amine::US10829492, Example 34
SMILES Cn1cc(cn1)-c1c(N)nn2ccc(nc12)N1CCC[C@@H]1c1cc(F)ccc1F
InChI Key InChIKey=AYRIJTTVHUWAEF-MRXNPFEDSA-N
Data  1 IC50
  Tab Delimited (TSV)   2D SDfile   Computed 3D by Vconf -m prep SDfile
Find this compound or compounds like it in BindingDB:
Activity Spreadsheet -- Enzyme Inhibition Constant Data from BindingDB
Found 1 hit for monomerid = 472757
TargetHigh affinity nerve growth factor receptor(Homo sapiens (Human))
Chia Tai Tianqing Pharmaceutical Group
US Patent
LigandPNGBDBM472757((R)-5-(2-(2,5-difluorophenyl)pyrrolidin-1-yl)-3-(1...)
Affinity DataIC50: <1nM. Assay description: TrkA, TrkB and TrkC:A testing platform for TrkA, TrkB and TrkC kinase activity was established based on Homogeneous Time-Resolved Fluorescence (HTRF)...
Ligand InfoPC cidPC sid
In DepthDetails US Patent