BDBM472830 US10829500, Exam. 5
SMILES NC1=N[C@@](CF)(C[S@@]2(=O)=NCCCCN12)c1nc(NC(=O)c2ccc(cn2)C#N)ccc1F
InChI Key InChIKey=VGEZZRMHKSHFMA-NLINSNCNSA-N
Data  1 IC50
  Tab Delimited (TSV)   2D SDfile   Computed 3D by Vconf -m prep SDfile
Find this compound or compounds like it in BindingDB:
Activity Spreadsheet -- Enzyme Inhibition Constant Data from BindingDB
Found 1 hit for monomerid = 472830
TargetBeta-secretase 1(Homo sapiens (Human))
Hoffmann-La Roche
US Patent
LigandPNGBDBM472830(US10829500, Exam. 5)
Affinity DataIC50:  28nM. Assay description: It has been found that the compounds of the present invention are associated with inhibition of BACE1 activity.
Ligand InfoPC cidPC sid
In DepthDetails US Patent