BDBM472832 US10836728, Compound (15)
SMILES CN(C)CC1CN(CCc2ccsc2)CCC1(O)c1cccc(c1)C(N)=O
InChI Key InChIKey=SDKDTFKHDGULFC-UHFFFAOYSA-N
Data  2 EC50
  Tab Delimited (TSV)   2D SDfile   Computed 3D by Vconf -m prep SDfile
Find this compound or compounds like it in BindingDB:
Activity Spreadsheet -- Enzyme Inhibition Constant Data from BindingDB
Found 2 hits for monomerid = 472832
TargetBeta-arrestin-1(Homo sapiens (Human))
Mebias Discovery
US Patent
LigandPNGBDBM472832(US10836728, Compound (15))
Affinity DataEC50: >1.00E+5nM. Assay description: The DISCOVERX PATHHUNTER® β-Arrestin assay is used to measure β-arrestin-2 activity. The technology is based on Enzyme Fragment Complementa...
Ligand InfoPC cidPC sid
In DepthDetails US Patent
TargetMu-type opioid receptor(Homo sapiens (Human))
Mebias Discovery
US Patent
LigandPNGBDBM472832(US10836728, Compound (15))
Affinity DataEC50:  67nM. Assay description: G-protein signaling was measured via second messenger cAMP modulation. Detection of cAMP modulation was accomplished in the PathHunter human OPRM1 (&...
Ligand InfoPC cidPC sid
In DepthDetails US Patent